{"text_format":"3","workbook":"xlsx","n_sheets":2,"sheets":["Cameras","Servers"],"not_rendered":{"external_links":1},"read":"whole","date_system":"1900"}

{"sheet":"Cameras","index":0,"n_rows":41,"n_cols":22,"rows_kept":41,"merged":[[1,6,1,10],[1,11,1,15],[1,16,1,20]]}
[]
[{"$nulls":6},"Input",{"$nulls":4},"Output 1",{"$nulls":4},"Output2"]
[null,"Camera ID","Server","Server Type",null,null,"Caption","Category","Action","VideoInput","Temp","Category","Caption","GeviScope alias","PTZ head","Speed","Category","Caption","G-Core alias","PTZ head","speed"]
[null,101030,"gscope-cdu-1","G-Core",{"$f":"B4","v":101030},null,{"$f":"CONCATENATE(\"GeVi \",I4,\"_\",E4)","v":"GeVi PanLeft_101030"},"Telemetry","PanLeft",{"$f":"E4","v":101030},{"$f":"IF(ISNUMBER(FIND(\"Focus\",I4)),0,\"\")","v":""},"GSC: Camera Control",{"$f":"CONCATENATE(\"GSC \",I4,IF(D4=\"G-Core\",\"\",CONCATENATE(\"_\",B4)))","v":"GSC PanLeft"},{"$f":"IF(D4=\"G-Core\",\"\",C4)","v":""},{"$f":"IF(D4=\"G-Core\",\"\",B4)","v":""},{"$f":"IF(ISNUMBER(FIND(\"Focus\",I4)),128,\"\")","v":""},"G-Core: Camera control",{"$f":"CONCATENATE(\"GNG \",I4,IF(D4=\"G-Core\",CONCATENATE(\"_\",E4),\"\"))","v":"GNG PanLeft_101030"},{"$f":"IF(D4=\"G-Core\",C4,\"\")","v":"gscope-cdu-1"},{"$f":"IF(D4=\"G-Core\",B4,\"\")","v":101030},{"$f":"IF(ISNUMBER(FIND(\"Focus\",I4)),128,\"\")","v":""}]
[null,101030,"gscope-cdu-1","G-Core",101030,null,"GeVi PanRight_101030","Telemetry","PanRight",101030,{"$f":"IF(ISNUMBER(FIND(\"Focus\",I5)),0,\"\")","v":""},"GSC: Camera Control","GSC PanRight","","",{"$f":"IF(ISNUMBER(FIND(\"Focus\",I5)),128,\"\")","v":""},"G-Core: Camera control",{"$f":"CONCATENATE(\"GNG \",I5,IF(D5=\"G-Core\",CONCATENATE(\"_\",E5),\"\"))","v":"GNG PanRight_101030"},{"$f":"IF(D5=\"G-Core\",C5,\"\")","v":"gscope-cdu-1"},{"$f":"IF(D5=\"G-Core\",B5,\"\")","v":101030},{"$f":"IF(ISNUMBER(FIND(\"Focus\",I5)),128,\"\")","v":""}]
[null,101030,"gscope-cdu-1","G-Core",101030,null,"GeVi PanStop_101030","Telemetry","PanStop",101030,"","GSC: Camera Control","GSC PanStop","","","","G-Core: Camera control",{"$f":"CONCATENATE(\"GNG \",I6,IF(D6=\"G-Core\",CONCATENATE(\"_\",E6),\"\"))","v":"GNG PanStop_101030"},{"$f":"IF(D6=\"G-Core\",C6,\"\")","v":"gscope-cdu-1"},{"$f":"IF(D6=\"G-Core\",B6,\"\")","v":101030},""]
[null,101030,"gscope-cdu-1","G-Core",101030,null,"GeVi TiltDown_101030","Telemetry","TiltDown",101030,"","GSC: Camera Control","GSC TiltDown","","","","G-Core: Camera control",{"$f":"CONCATENATE(\"GNG \",I7,IF(D7=\"G-Core\",CONCATENATE(\"_\",E7),\"\"))","v":"GNG TiltDown_101030"},{"$f":"IF(D7=\"G-Core\",C7,\"\")","v":"gscope-cdu-1"},{"$f":"IF(D7=\"G-Core\",B7,\"\")","v":101030},""]
[null,101030,"gscope-cdu-1","G-Core",101030,null,"GeVi TiltUp_101030","Telemetry","TiltUp",101030,"","GSC: Camera Control","GSC TiltUp","","","","G-Core: Camera control",{"$f":"CONCATENATE(\"GNG \",I8,IF(D8=\"G-Core\",CONCATENATE(\"_\",E8),\"\"))","v":"GNG TiltUp_101030"},{"$f":"IF(D8=\"G-Core\",C8,\"\")","v":"gscope-cdu-1"},{"$f":"IF(D8=\"G-Core\",B8,\"\")","v":101030},""]
[null,101030,"gscope-cdu-1","G-Core",101030,null,"GeVi TiltStop_101030","Telemetry","TiltStop",101030,"","GSC: Camera Control","GSC TiltStop","","","","G-Core: Camera control",{"$f":"CONCATENATE(\"GNG \",I9,IF(D9=\"G-Core\",CONCATENATE(\"_\",E9),\"\"))","v":"GNG TiltStop_101030"},{"$f":"IF(D9=\"G-Core\",C9,\"\")","v":"gscope-cdu-1"},{"$f":"IF(D9=\"G-Core\",B9,\"\")","v":101030},""]
[null,101030,"gscope-cdu-1","G-Core",101030,null,"GeVi ZoomIn_101030","Telemetry","ZoomIn",101030,"","GSC: Camera Control","GSC ZoomIn","","","","G-Core: Camera control",{"$f":"CONCATENATE(\"GNG \",I10,IF(D10=\"G-Core\",CONCATENATE(\"_\",E10),\"\"))","v":"GNG ZoomIn_101030"},{"$f":"IF(D10=\"G-Core\",C10,\"\")","v":"gscope-cdu-1"},{"$f":"IF(D10=\"G-Core\",B10,\"\")","v":101030},""]
[null,101030,"gscope-cdu-1","G-Core",101030,null,"GeVi ZoomOut_101030","Telemetry","ZoomOut",101030,"","GSC: Camera Control","GSC ZoomOut","","","","G-Core: Camera control",{"$f":"CONCATENATE(\"GNG \",I11,IF(D11=\"G-Core\",CONCATENATE(\"_\",E11),\"\"))","v":"GNG ZoomOut_101030"},{"$f":"IF(D11=\"G-Core\",C11,\"\")","v":"gscope-cdu-1"},{"$f":"IF(D11=\"G-Core\",B11,\"\")","v":101030},""]
[null,101030,"gscope-cdu-1","G-Core",101030,null,"GeVi ZoomStop_101030","Telemetry","ZoomStop",101030,"","GSC: Camera Control","GSC ZoomStop","","","","G-Core: Camera control",{"$f":"CONCATENATE(\"GNG \",I12,IF(D12=\"G-Core\",CONCATENATE(\"_\",E12),\"\"))","v":"GNG ZoomStop_101030"},{"$f":"IF(D12=\"G-Core\",C12,\"\")","v":"gscope-cdu-1"},{"$f":"IF(D12=\"G-Core\",B12,\"\")","v":101030},""]
[null,101030,"gscope-cdu-1","G-Core",101030,null,"GeVi FocusFar_101030","Telemetry","FocusFar",101030,0,"GSC: Camera Control","GSC FocusFar","","",128,"G-Core: Camera control",{"$f":"CONCATENATE(\"GNG \",I13,IF(D13=\"G-Core\",CONCATENATE(\"_\",E13),\"\"))","v":"GNG FocusFar_101030"},{"$f":"IF(D13=\"G-Core\",C13,\"\")","v":"gscope-cdu-1"},{"$f":"IF(D13=\"G-Core\",B13,\"\")","v":101030},128]
[null,101030,"gscope-cdu-1","G-Core",101030,null,"GeVi FocusNear_101030","Telemetry","FocusNear",101030,0,"GSC: Camera Control","GSC FocusNear","","",128,"G-Core: Camera control",{"$f":"CONCATENATE(\"GNG \",I14,IF(D14=\"G-Core\",CONCATENATE(\"_\",E14),\"\"))","v":"GNG FocusNear_101030"},{"$f":"IF(D14=\"G-Core\",C14,\"\")","v":"gscope-cdu-1"},{"$f":"IF(D14=\"G-Core\",B14,\"\")","v":101030},128]
[null,101030,"gscope-cdu-1","G-Core",101030,null,"GeVi FocusStop_101030","Telemetry","FocusStop",101030,0,"GSC: Camera Control","GSC FocusStop","","",128,"G-Core: Camera control",{"$f":"CONCATENATE(\"GNG \",I15,IF(D15=\"G-Core\",CONCATENATE(\"_\",E15),\"\"))","v":"GNG FocusStop_101030"},{"$f":"IF(D15=\"G-Core\",C15,\"\")","v":"gscope-cdu-1"},{"$f":"IF(D15=\"G-Core\",B15,\"\")","v":101030},128]
[null,101030,"gscope-cdu-1","G-Core",101030,null,"GeVi DefaultPosCalUp_101030","Telemetry","DefaultPosCalUp",101030,"","GSC: Camera Control","GSC DefaultPosCalUp","","","","G-Core: Camera control",{"$f":"CONCATENATE(\"GNG \",I16,IF(D16=\"G-Core\",CONCATENATE(\"_\",E16),\"\"))","v":"GNG DefaultPosCalUp_101030"},{"$f":"IF(D16=\"G-Core\",C16,\"\")","v":"gscope-cdu-1"},{"$f":"IF(D16=\"G-Core\",B16,\"\")","v":101030},""]
[null,101030,"gscope-cdu-1","G-Core",101030,null,"GeVi DefaultPosClear_101030","Telemetry","DefaultPosClear",101030,"","GSC: Camera Control","GSC DefaultPosClear","","","","G-Core: Camera control",{"$f":"CONCATENATE(\"GNG \",I17,IF(D17=\"G-Core\",CONCATENATE(\"_\",E17),\"\"))","v":"GNG DefaultPosClear_101030"},{"$f":"IF(D17=\"G-Core\",C17,\"\")","v":"gscope-cdu-1"},{"$f":"IF(D17=\"G-Core\",B17,\"\")","v":101030},""]
[null,101030,"gscope-cdu-1","G-Core",101030,null,"GeVi DefaultPosSave_101030","Telemetry","DefaultPosSave",101030,"","GSC: Camera Control","GSC DefaultPosSave","","","","G-Core: Camera control",{"$f":"CONCATENATE(\"GNG \",I18,IF(D18=\"G-Core\",CONCATENATE(\"_\",E18),\"\"))","v":"GNG DefaultPosSave_101030"},{"$f":"IF(D18=\"G-Core\",C18,\"\")","v":"gscope-cdu-1"},{"$f":"IF(D18=\"G-Core\",B18,\"\")","v":101030},""]
[null,101030,"gscope-cdu-1","G-Core",101030,null,"GeVi IrisClose_101030","Telemetry","IrisClose",101030,"","GSC: Camera Control","GSC IrisClose","","","","G-Core: Camera control",{"$f":"CONCATENATE(\"GNG \",I19,IF(D19=\"G-Core\",CONCATENATE(\"_\",E19),\"\"))","v":"GNG IrisClose_101030"},{"$f":"IF(D19=\"G-Core\",C19,\"\")","v":"gscope-cdu-1"},{"$f":"IF(D19=\"G-Core\",B19,\"\")","v":101030},""]
[null,101030,"gscope-cdu-1","G-Core",101030,null,"GeVi IrisOpen_101030","Telemetry","IrisOpen",101030,"","GSC: Camera Control","GSC IrisOpen","","","","G-Core: Camera control",{"$f":"CONCATENATE(\"GNG \",I20,IF(D20=\"G-Core\",CONCATENATE(\"_\",E20),\"\"))","v":"GNG IrisOpen_101030"},{"$f":"IF(D20=\"G-Core\",C20,\"\")","v":"gscope-cdu-1"},{"$f":"IF(D20=\"G-Core\",B20,\"\")","v":101030},""]
[null,101030,"gscope-cdu-1","G-Core",101030,null,"GeVi IrisStop_101030","Telemetry","IrisStop",101030,"","GSC: Camera Control","GSC IrisStop","","","","G-Core: Camera control",{"$f":"CONCATENATE(\"GNG \",I21,IF(D21=\"G-Core\",CONCATENATE(\"_\",E21),\"\"))","v":"GNG IrisStop_101030"},{"$f":"IF(D21=\"G-Core\",C21,\"\")","v":"gscope-cdu-1"},{"$f":"IF(D21=\"G-Core\",B21,\"\")","v":101030},""]
[null,106001,"GSC - Praha 6 - 1","GeViScope",{"$f":"B22","v":106001},null,{"$f":"CONCATENATE(\"GeVi \",I22,\"_\",E22)","v":"GeVi PanLeft_106001"},"Telemetry","PanLeft",{"$f":"E22","v":106001},"","GSC: Camera Control",{"$f":"CONCATENATE(\"GSC \",I22,IF(D22=\"G-Core\",\"\",CONCATENATE(\"_\",B22)))","v":"GSC PanLeft_106001"},{"$f":"IF(D22=\"G-Core\",\"\",C22)","v":"GSC - Praha 6 - 1"},{"$f":"IF(D22=\"G-Core\",\"\",B22)","v":106001},"","G-Core: Camera control",{"$f":"CONCATENATE(\"GNG \",I22,IF(D22=\"G-Core\",CONCATENATE(\"_\",E22),\"\"))","v":"GNG PanLeft"},{"$f":"IF(D22=\"G-Core\",C22,\"\")","v":""},{"$f":"IF(D22=\"G-Core\",B22,\"\")","v":""},""]
[null,106001,"GSC - Praha 6 - 1","GeViScope",106001,null,"GeVi PanRight_106001","Telemetry","PanRight",106001,"","GSC: Camera Control","GSC PanRight_106001","GSC - Praha 6 - 1",106001,"","G-Core: Camera control",{"$f":"CONCATENATE(\"GNG \",I23,IF(D23=\"G-Core\",CONCATENATE(\"_\",E23),\"\"))","v":"GNG PanRight"},{"$f":"IF(D23=\"G-Core\",C23,\"\")","v":""},{"$f":"IF(D23=\"G-Core\",B23,\"\")","v":""},""]
[null,106001,"GSC - Praha 6 - 1","GeViScope",106001,null,"GeVi PanStop_106001","Telemetry","PanStop",106001,"","GSC: Camera Control","GSC PanStop_106001","GSC - Praha 6 - 1",106001,"","G-Core: Camera control",{"$f":"CONCATENATE(\"GNG \",I24,IF(D24=\"G-Core\",CONCATENATE(\"_\",E24),\"\"))","v":"GNG PanStop"},{"$f":"IF(D24=\"G-Core\",C24,\"\")","v":""},{"$f":"IF(D24=\"G-Core\",B24,\"\")","v":""},""]
[null,106001,"GSC - Praha 6 - 1","GeViScope",106001,null,"GeVi TiltDown_106001","Telemetry","TiltDown",106001,"","GSC: Camera Control","GSC TiltDown_106001","GSC - Praha 6 - 1",106001,"","G-Core: Camera control",{"$f":"CONCATENATE(\"GNG \",I25,IF(D25=\"G-Core\",CONCATENATE(\"_\",E25),\"\"))","v":"GNG TiltDown"},{"$f":"IF(D25=\"G-Core\",C25,\"\")","v":""},{"$f":"IF(D25=\"G-Core\",B25,\"\")","v":""},""]
[null,106001,"GSC - Praha 6 - 1","GeViScope",106001,null,"GeVi TiltUp_106001","Telemetry","TiltUp",106001,"","GSC: Camera Control","GSC TiltUp_106001","GSC - Praha 6 - 1",106001,"","G-Core: Camera control",{"$f":"CONCATENATE(\"GNG \",I26,IF(D26=\"G-Core\",CONCATENATE(\"_\",E26),\"\"))","v":"GNG TiltUp"},{"$f":"IF(D26=\"G-Core\",C26,\"\")","v":""},{"$f":"IF(D26=\"G-Core\",B26,\"\")","v":""},""]
[null,106001,"GSC - Praha 6 - 1","GeViScope",106001,null,"GeVi TiltStop_106001","Telemetry","TiltStop",106001,"","GSC: Camera Control","GSC TiltStop_106001","GSC - Praha 6 - 1",106001,"","G-Core: Camera control",{"$f":"CONCATENATE(\"GNG \",I27,IF(D27=\"G-Core\",CONCATENATE(\"_\",E27),\"\"))","v":"GNG TiltStop"},{"$f":"IF(D27=\"G-Core\",C27,\"\")","v":""},{"$f":"IF(D27=\"G-Core\",B27,\"\")","v":""},""]
[null,106001,"GSC - Praha 6 - 1","GeViScope",106001,null,"GeVi ZoomIn_106001","Telemetry","ZoomIn",106001,"","GSC: Camera Control","GSC ZoomIn_106001","GSC - Praha 6 - 1",106001,"","G-Core: Camera control",{"$f":"CONCATENATE(\"GNG \",I28,IF(D28=\"G-Core\",CONCATENATE(\"_\",E28),\"\"))","v":"GNG ZoomIn"},{"$f":"IF(D28=\"G-Core\",C28,\"\")","v":""},{"$f":"IF(D28=\"G-Core\",B28,\"\")","v":""},""]
[null,106001,"GSC - Praha 6 - 1","GeViScope",106001,null,"GeVi ZoomOut_106001","Telemetry","ZoomOut",106001,"","GSC: Camera Control","GSC ZoomOut_106001","GSC - Praha 6 - 1",106001,"","G-Core: Camera control",{"$f":"CONCATENATE(\"GNG \",I29,IF(D29=\"G-Core\",CONCATENATE(\"_\",E29),\"\"))","v":"GNG ZoomOut"},{"$f":"IF(D29=\"G-Core\",C29,\"\")","v":""},{"$f":"IF(D29=\"G-Core\",B29,\"\")","v":""},""]
[null,106001,"GSC - Praha 6 - 1","GeViScope",106001,null,"GeVi ZoomStop_106001","Telemetry","ZoomStop",106001,"","GSC: Camera Control","GSC ZoomStop_106001","GSC - Praha 6 - 1",106001,"","G-Core: Camera control",{"$f":"CONCATENATE(\"GNG \",I30,IF(D30=\"G-Core\",CONCATENATE(\"_\",E30),\"\"))","v":"GNG ZoomStop"},{"$f":"IF(D30=\"G-Core\",C30,\"\")","v":""},{"$f":"IF(D30=\"G-Core\",B30,\"\")","v":""},""]
[null,106001,"GSC - Praha 6 - 1","GeViScope",106001,null,"GeVi FocusFar_106001","Telemetry","FocusFar",106001,0,"GSC: Camera Control","GSC FocusFar_106001","GSC - Praha 6 - 1",106001,128,"G-Core: Camera control",{"$f":"CONCATENATE(\"GNG \",I31,IF(D31=\"G-Core\",CONCATENATE(\"_\",E31),\"\"))","v":"GNG FocusFar"},{"$f":"IF(D31=\"G-Core\",C31,\"\")","v":""},{"$f":"IF(D31=\"G-Core\",B31,\"\")","v":""},128]
[null,106001,"GSC - Praha 6 - 1","GeViScope",106001,null,"GeVi FocusNear_106001","Telemetry","FocusNear",106001,0,"GSC: Camera Control","GSC FocusNear_106001","GSC - Praha 6 - 1",106001,128,"G-Core: Camera control",{"$f":"CONCATENATE(\"GNG \",I32,IF(D32=\"G-Core\",CONCATENATE(\"_\",E32),\"\"))","v":"GNG FocusNear"},{"$f":"IF(D32=\"G-Core\",C32,\"\")","v":""},{"$f":"IF(D32=\"G-Core\",B32,\"\")","v":""},128]
[null,106001,"GSC - Praha 6 - 1","GeViScope",106001,null,"GeVi FocusStop_106001","Telemetry","FocusStop",106001,0,"GSC: Camera Control","GSC FocusStop_106001","GSC - Praha 6 - 1",106001,128,"G-Core: Camera control",{"$f":"CONCATENATE(\"GNG \",I33,IF(D33=\"G-Core\",CONCATENATE(\"_\",E33),\"\"))","v":"GNG FocusStop"},{"$f":"IF(D33=\"G-Core\",C33,\"\")","v":""},{"$f":"IF(D33=\"G-Core\",B33,\"\")","v":""},128]
[null,106001,"GSC - Praha 6 - 1","GeViScope",106001,null,"GeVi DefaultPosCalUp_106001","Telemetry","DefaultPosCalUp",106001,"","GSC: Camera Control","GSC DefaultPosCalUp_106001","GSC - Praha 6 - 1",106001,"","G-Core: Camera control",{"$f":"CONCATENATE(\"GNG \",I34,IF(D34=\"G-Core\",CONCATENATE(\"_\",E34),\"\"))","v":"GNG DefaultPosCalUp"},{"$f":"IF(D34=\"G-Core\",C34,\"\")","v":""},{"$f":"IF(D34=\"G-Core\",B34,\"\")","v":""},""]
[null,106001,"GSC - Praha 6 - 1","GeViScope",106001,null,"GeVi DefaultPosClear_106001","Telemetry","DefaultPosClear",106001,"","GSC: Camera Control","GSC DefaultPosClear_106001","GSC - Praha 6 - 1",106001,"","G-Core: Camera control",{"$f":"CONCATENATE(\"GNG \",I35,IF(D35=\"G-Core\",CONCATENATE(\"_\",E35),\"\"))","v":"GNG DefaultPosClear"},{"$f":"IF(D35=\"G-Core\",C35,\"\")","v":""},{"$f":"IF(D35=\"G-Core\",B35,\"\")","v":""},""]
[null,106001,"GSC - Praha 6 - 1","GeViScope",106001,null,"GeVi DefaultPosSave_106001","Telemetry","DefaultPosSave",106001,"","GSC: Camera Control","GSC DefaultPosSave_106001","GSC - Praha 6 - 1",106001,"","G-Core: Camera control",{"$f":"CONCATENATE(\"GNG \",I36,IF(D36=\"G-Core\",CONCATENATE(\"_\",E36),\"\"))","v":"GNG DefaultPosSave"},{"$f":"IF(D36=\"G-Core\",C36,\"\")","v":""},{"$f":"IF(D36=\"G-Core\",B36,\"\")","v":""},""]
[null,106001,"GSC - Praha 6 - 1","GeViScope",106001,null,"GeVi IrisClose_106001","Telemetry","IrisClose",106001,"","GSC: Camera Control","GSC IrisClose_106001","GSC - Praha 6 - 1",106001,"","G-Core: Camera control",{"$f":"CONCATENATE(\"GNG \",I37,IF(D37=\"G-Core\",CONCATENATE(\"_\",E37),\"\"))","v":"GNG IrisClose"},{"$f":"IF(D37=\"G-Core\",C37,\"\")","v":""},{"$f":"IF(D37=\"G-Core\",B37,\"\")","v":""},""]
[null,106001,"GSC - Praha 6 - 1","GeViScope",106001,null,"GeVi IrisOpen_106001","Telemetry","IrisOpen",106001,"","GSC: Camera Control","GSC IrisOpen_106001","GSC - Praha 6 - 1",106001,"","G-Core: Camera control",{"$f":"CONCATENATE(\"GNG \",I38,IF(D38=\"G-Core\",CONCATENATE(\"_\",E38),\"\"))","v":"GNG IrisOpen"},{"$f":"IF(D38=\"G-Core\",C38,\"\")","v":""},{"$f":"IF(D38=\"G-Core\",B38,\"\")","v":""},""]
[null,106001,"GSC - Praha 6 - 1","GeViScope",106001,null,"GeVi IrisStop_106001","Telemetry","IrisStop",106001,"","GSC: Camera Control","GSC IrisStop_106001","GSC - Praha 6 - 1",106001,"","G-Core: Camera control",{"$f":"CONCATENATE(\"GNG \",I39,IF(D39=\"G-Core\",CONCATENATE(\"_\",E39),\"\"))","v":"GNG IrisStop"},{"$f":"IF(D39=\"G-Core\",C39,\"\")","v":""},{"$f":"IF(D39=\"G-Core\",B39,\"\")","v":""},""]
[null,101001,"GSC - PI - Karluv most",{"$f":"VLOOKUP(C40,[1]Servers!B:C,2,FALSE)","v":"GeViScope"},101001,null,{"$f":"CONCATENATE(\"GeVi \",I40,IF(ISNUMBER(FIND(\"Cross\",I40)),\" C_\",\"_\"),E40, \" -> M\")","v":"GeVi CrossSwitch C_101001 -> M"},"Crossbar control","CrossSwitch",{"$f":"E40","v":101001},"","GSC: Viewer actions",{"$f":"CONCATENATE(\"GSC ViewerConnectLive V <- C\",IF(D40=\"G-Core\",\"\",CONCATENATE(\"_\",E40)))","v":"GSC ViewerConnectLive V <- C_101001"},{"$f":"IF(D40=\"G-Core\",\"\",C40)","v":"GSC - PI - Karluv most"},{"$f":"E40","v":101001},"","G-Core-Viewer actions",{"$f":"CONCATENATE(\"GNG ViewerConnectLive V <- C\",IF(D40=\"G-Core\",CONCATENATE(\"_\",J40),\"\"))","v":"GNG ViewerConnectLive V <- C"},null,{"$f":"IF(D40=\"G-Core\",C40,\"\")","v":""},"",{"$f":"IF(ISNUMBER(FIND(\"Focus\",I40)),128,\"\")","v":""}]
[null,101004,"gscope-cdu-1",{"$f":"VLOOKUP(C41,[1]Servers!B:C,2,FALSE)","v":"G-Core"},101004,null,{"$f":"CONCATENATE(\"GeVi \",I41,IF(ISNUMBER(FIND(\"Cross\",I41)),\" C_\",\"_\"),E41, \" -> M\")","v":"GeVi CrossSwitch C_101004 -> M"},"Crossbar control","CrossSwitch",{"$f":"E41","v":101004},"","GSC: Viewer actions",{"$f":"CONCATENATE(\"GSC ViewerConnectLive V <- C\",IF(D41=\"G-Core\",\"\",CONCATENATE(\"_\",E41)))","v":"GSC ViewerConnectLive V <- C"},{"$f":"IF(D41=\"G-Core\",\"\",C41)","v":""},{"$f":"E41","v":101004},null,"G-Core-Viewer actions",{"$f":"CONCATENATE(\"GNG ViewerConnectLive V <- C\",IF(D41=\"G-Core\",CONCATENATE(\"_\",J41),\"\"))","v":"GNG ViewerConnectLive V <- C_101004"},{"$f":"IF(D41=\"G-Core\",C41,\"\")","v":"gscope-cdu-1"},null,""]

{"sheet":"Servers","index":1,"n_rows":85,"n_cols":6,"rows_kept":85}
[]
[null,"Hostname","Typ","IP server","Username","Password"]
[null,"TSK_JS_I","GeViScope","10.240.30.31","sysadmin","masterkey"]
[null,"TSK_JS_III","GeViScope","10.240.30.33","sysadmin","masterkey"]
[null,"TSK_JS_IV","GeViScope","10.240.30.34","sysadmin","masterkey"]
[null,"TSK_JS_V","GeViScope","10.240.30.35","sysadmin","masterkey"]
[null,"TSK_JS_VI","GeViScope","10.240.30.36","sysadmin","masterkey"]
[null,"GCE-BL-TGC1A1","G-Core","10.240.37.61","sysadmin","masterkey"]
[null,"GCE-BL-TGC1A2","G-Core","10.240.37.62","sysadmin","masterkey"]
[null,"GCE-BL-TGC1B3","G-Core","10.240.37.63","sysadmin","masterkey"]
[null,"GCE-BL-TGC1B4","G-Core","10.240.37.64","sysadmin","masterkey"]
[null,"GCE-BL-TGC3A5","G-Core","10.240.37.65","sysadmin","masterkey"]
[null,"GCE-BL-TGC3A6","G-Core","10.240.37.66","sysadmin","masterkey"]
[null,"GCE-BL-TGC3A7","G-Core","10.240.37.67","sysadmin","masterkey"]
[null,"GCE-BL-TGC3A8","G-Core","10.240.37.68","sysadmin","masterkey"]
[null,"GCE-BL-TGC3B9","G-Core","10.240.37.69","sysadmin","masterkey"]
[null,"GCE-BL-TGC3B10","G-Core","10.240.37.70","sysadmin","masterkey"]
[null,"GCE-BL-TGC3B11","G-Core","10.240.37.71","sysadmin","masterkey"]
[null,"GCE-BL-TGC3B12","G-Core","10.240.37.72","sysadmin","masterkey"]
[null,"GCE-BL-TGC1FR","G-Core","10.240.37.73","sysadmin","masterkey"]
[null,"GCE-BL-TGC3AFR","G-Core","10.240.37.74","sysadmin","masterkey"]
[null,"GCE-BL-TGC3BFR","G-Core","10.240.37.75","sysadmin","masterkey"]
[null,"GSCOPE-DC5-1","G-Core","10.240.140.21","sysadmin","masterkey"]
[null,"GSCOPE-DC5-2","G-Core","10.240.140.22","sysadmin","masterkey"]
[null,"GSCOPE-DC5-3","G-Core","10.240.140.23","sysadmin","masterkey"]
[null,"GSCOPE-DC5-4","G-Core","10.240.140.24","sysadmin","masterkey"]
[null,"GSCOPE-DC5-5","G-Core","10.240.140.25","sysadmin","masterkey"]
[null,"GSCOPE-DC5-6","G-Core","10.240.140.26","sysadmin","masterkey"]
[null,"GSCOPE-DC5-7","G-Core","10.240.140.27","sysadmin","masterkey"]
[null,"GSCOPE-DC5-8","G-Core","10.240.140.28","sysadmin","masterkey"]
[null,"G-SCOPE-PI-FLORENC","G-Core","10.240.1.33","sysadmin","masterkey"]
[null,"GSCOPE-P6-9","G-Core","10.240.6.39","sysadmin","masterkey"]
[null,"GSCOPE-PII-8","G-Core","10.240.2.38","sysadmin","masterkey"]
[null,"GSCOPE-PI-6-M","G-Core","10.240.1.43","sysadmin","masterkey"]
[null,"GSCOPE-PIII-13","G-Core","10.240.3.43","sysadmin","masterkey"]
[null,"GSCOPE-PIV-11","G-Core","10.240.4.41","sysadmin","masterkey"]
[null,"GSC-HN-1","GeViScope","10.240.1.31","sysadmin","masterkey"]
[null,"GSC-HN-2","GeViScope","10.240.1.32","sysadmin","masterkey"]
[null,"GSC - Praha 6 - 1","GeViScope","10.240.6.31","sysadmin","masterkey"]
[null,"GSC - Praha 6 - 2","GeViScope","10.240.6.32","sysadmin","masterkey"]
[null,"GSC - Praha 6 - 3","GeViScope","10.240.6.33","sysadmin","masterkey"]
[null,"GSC - Praha 6 - 8","GeViScope","10.240.6.38","sysadmin","masterkey"]
[null,"GSC-PI-SE","GeViScope","10.240.1.41","sysadmin","masterkey"]
[null,"GSC - PI - Karlův most","GeViScope","10.240.1.36","sysadmin","masterkey"]
[null,"GSC - Praha II - 1","GeViScope","10.240.2.31","sysadmin","masterkey"]
[null,"GSC - Praha II - 4","GeViScope","10.240.2.34","sysadmin","masterkey"]
[null,"GSC - Praha II - 7","GeViScope","10.240.2.37","sysadmin","masterkey"]
[null,"GSC - Praha III - 1","GeViScope","10.240.3.31","sysadmin","masterkey"]
[null,"GSC - Praha III - 10","GeViScope","10.240.3.40","sysadmin","masterkey"]
[null,"GSC - Praha III - 11","GeViScope","10.240.3.41","sysadmin","masterkey"]
[null,"GSC - Praha III - 3","GeViScope","10.240.3.33","sysadmin","masterkey"]
[null,"GSC - Praha III - 5","GeViScope","10.240.3.35","sysadmin","masterkey"]
[null,"GSC - Praha III - 8","GeViScope","10.240.3.38","sysadmin","masterkey"]
[null,"GSC - Praha IV - 1","GeViScope","10.240.4.31","sysadmin","masterkey"]
[null,"GSC - Praha IV - 2","GeViScope","10.240.4.32","sysadmin","masterkey"]
[null,"GSC - Praha IV - 5","GeViScope","10.240.4.35","sysadmin","masterkey"]
[null,"GSC - Praha IV - 9","GeViScope","10.240.4.39","sysadmin","masterkey"]
[null,"GSC - UMR - 1 ","GeViScope","10.240.34.31","sysadmin","masterkey"]
[null,"GSC - UMR - 2","GeViScope","10.240.34.32","sysadmin","masterkey"]
[null,"gscope-cdu-1","G-Core","10.240.130.79","sysadmin","masterkey"]
[null,"gscope-cdu-2","G-Core","10.240.130.80","sysadmin","masterkey"]
[null,"gscope-cdu-3","G-Core","10.240.130.81","sysadmin","masterkey"]
[null,"GST - CDU - 11","GeViScope","10.240.130.61","sysadmin","masterkey"]
[null,"GST - CDU - 12","GeViScope","10.240.130.62","sysadmin","masterkey"]
[null,"GST - CDU - 13","GeViScope","10.240.130.63","sysadmin","masterkey"]
[null,"GST - CDU - 14","GeViScope","10.240.130.64","sysadmin","masterkey"]
[null,"GST - CDU - 7","GeViScope","10.240.130.57","sysadmin","masterkey"]
[null,"GST - CDU - 8","GeViScope","10.240.130.58","sysadmin","masterkey"]
[null,"TSK_OPD1_1","GeViScope","10.240.41.21","sysadmin","masterkey"]
[null,"TSK_OPD1_2","GeViScope","10.240.41.22","sysadmin","masterkey"]
[null,"TSK_OPD1_3","GeViScope","10.240.41.23","sysadmin","masterkey"]
[null,"TSK_OPD1_4","GeViScope","10.240.41.24","sysadmin","masterkey"]
[null,"TSK_OPD4_1","GeViScope","10.240.30.37","sysadmin","masterkey"]
[null,"TSK_OPD4_2","GeViScope","10.240.30.38","sysadmin","masterkey"]
[null,"TSK_OPD4_3","GeViScope","10.240.30.39","sysadmin","masterkey"]
[null,"TSK_GST_11","G-Core","10.240.30.40","sysadmin","masterkey"]
[null,"GST-ATM","G-Core","10.240.38.41","sysadmin","masterkey"]
[null,"GST-HDRU-1","G-Core","10.240.46.41","sysadmin","masterkey"]
[null,"GST-HDRU-2","G-Core","10.240.46.42","sysadmin","masterkey"]
[null,"GST-LAT","G-Core","10.240.54.61","sysadmin","masterkey"]
[null,"GST-ODRU","G-Core","10.240.38.61","sysadmin","masterkey"]
[null,"GST-SAT-1","G-Core","10.240.39.41","sysadmin","masterkey"]
[null,"GST-SAT-2","G-Core","10.240.39.42","sysadmin","masterkey"]
[null,"GST-TAT","G-Core","10.240.53.21","sysadmin","masterkey"]
[null,"GST-ZAT","G-Core","10.240.38.81","sysadmin","masterkey"]